{"text_format":"3","workbook":"xlsx","n_sheets":3,"sheets":["Übersicht","Aufstellung","Ergebnisse 9er"],"read":"whole","date_system":"1900"}

{"sheet":"Übersicht","index":0,"n_rows":29,"n_cols":92,"rows_kept":29,"merged":[[0,0,0,16],[0,20,0,24],[0,25,0,28],[0,32,0,38],[0,39,0,43],[1,0,1,16],[1,20,1,24],[1,25,1,28],[1,32,1,38],[1,39,1,43],[3,2,3,4],[3,5,3,7],[3,8,3,10],[3,11,3,13],[3,14,3,16],[3,17,3,19],[3,20,3,22],[3,23,3,25],[3,26,3,28],[3,29,3,31],[3,32,3,34],[3,35,3,37],[3,38,3,40],[3,42,3,44],[4,2,4,4],[5,5,5,7],[6,8,6,10],[7,11,7,13],[8,14,8,16],[9,17,9,19],[10,20,10,22],[11,23,11,25],[12,26,12,28],[13,29,13,31],[14,32,14,34],[15,35,15,37],[16,38,16,40],[18,1,18,46],[20,2,20,13],[20,15,20,26],[20,29,20,40],[22,2,22,8],[22,12,22,15],[22,16,22,23],[22,26,22,29],[22,30,22,36],[22,37,22,40],[22,41,22,45],[24,2,24,8],[24,12,24,15],[24,16,24,23],[24,26,24,29],[24,30,24,36],[26,2,26,8],[26,12,26,15],[26,16,26,23],[26,26,26,29],[26,30,26,36],[28,2,28,8],[28,12,28,15],[28,16,28,23],[28,26,28,29],[28,30,28,36]]}
["Jugendrunde „Jeder gegen Jeden“",{"$nulls":19},"Jugend:",{"$nulls":11},"Datum:"]
["Für 9-er Staffeln",{"$nulls":19},"Spieltag:",{"$nulls":11},"Halle:"]
[]
[null,null,{"$f":"IF(B5=0,\"\",B5)","v":"t1"},null,null,{"$f":"IF(B6=0,\"\",B6)","v":"t2"},null,null,{"$f":"IF(B7=0,\"\",B7)","v":"t3"},null,null,{"$f":"IF(B8=0,\"\",B8)","v":"t4"},null,null,{"$f":"IF($B9=0,\"\",$B9)","v":"t5"},null,null,{"$f":"IF($B10=0,\"\",$B10)","v":"t6"},null,null,{"$f":"IF($B11=0,\"\",$B11)","v":"t7"},null,null,{"$f":"IF($B12=0,\"\",$B12)","v":"t8"},null,null,{"$f":"IF($B13=0,\"\",$B13)","v":"t9"},null,null,{"$f":"IF($B14=0,\"\",$B14)","v":""},null,null,{"$f":"IF($B15=0,\"\",$B15)","v":""},null,null,{"$f":"IF($B16=0,\"\",$B16)","v":""},null,null,{"$f":"IF($B17=0,\"\",$B17)","v":""},null,null,"Pkt.","kl. Punkte",null,null,"Quot","Platz",{"$nulls":43},"Punkt-Rang"]
[1,{"$f":"IF(Aufstellung!D5<>\"\",Aufstellung!D5,\"\")","v":"t1"},{"$nulls":3},{"$f":"'Ergebnisse 9er'!L14","v":0},":",{"$f":"'Ergebnisse 9er'!N14","v":0},{"$f":"'Ergebnisse 9er'!N27","v":0},":",{"$f":"'Ergebnisse 9er'!L27","v":0},{"$f":"'Ergebnisse 9er'!E13","v":0},":",{"$f":"'Ergebnisse 9er'!G13","v":0},{"$f":"'Ergebnisse 9er'!G22","v":0},":",{"$f":"'Ergebnisse 9er'!E22","v":0},{"$f":"'Ergebnisse 9er'!E3","v":0},":",{"$f":"'Ergebnisse 9er'!G3","v":0},{"$f":"'Ergebnisse 9er'!N21","v":0},":",{"$f":"'Ergebnisse 9er'!L21","v":0},{"$f":"'Ergebnisse 9er'!L4","v":0},":",{"$f":"'Ergebnisse 9er'!N4","v":0},{"$f":"'Ergebnisse 9er'!G28","v":0},":",{"$f":"'Ergebnisse 9er'!E28","v":0},{"$nulls":12},{"$f":"CI5","v":0},{"$f":"IF((C5+F5+I5+L5+O5+R5+U5+X5+AA5)=0,0,(C5+F5+I5+L5+O5+R5+U5+X5+AA5))","v":0},":",{"$f":"IF((E5+H5+K5+N5+Q5+T5+W5+Z5+AC5)=0,0,(E5+H5+K5+N5+Q5+T5+W5+Z5+AC5))","v":0},{"$f":"IF(AS5=0,0,AQ5/AS5)","v":0},{"$f":"IF(AND(AQ5=0,AS5=0),\"\",CM5)","v":""},null,{"$f":"IF(OR(C5<>0,E5<>0),IF(C5>E5,2,IF(C5=E5,1,0)),0)","v":0},null,null,{"$f":"IF(OR(F5<>0,H5<>0),IF(F5>H5,2,IF(F5=H5,1,0)),0)","v":0},null,null,{"$f":"IF(OR(I5<>0,K5<>0),IF(I5>K5,2,IF(I5=K5,1,0)),0)","v":0},null,null,{"$f":"IF(OR(L5<>0,N5<>0),IF(L5>N5,2,IF(L5=N5,1,0)),0)","v":0},null,null,{"$f":"IF(OR(O5<>0,Q5<>0),IF(O5>Q5,2,IF(O5=Q5,1,0)),0)","v":0},null,null,{"$f":"IF(OR(R5<>0,T5<>0),IF(R5>T5,2,IF(R5=T5,1,0)),0)","v":0},null,null,{"$f":"IF(OR(U5<>0,W5<>0),IF(U5>W5,2,IF(U5=W5,1,0)),0)","v":0},null,null,{"$f":"IF(OR(X5<>0,Z5<>0),IF(X5>Z5,2,IF(X5=Z5,1,0)),0)","v":0},null,null,{"$f":"IF(OR(AA5<>0,AC5<>0),IF(AA5>AC5,2,IF(AA5=AC5,1,0)),0)","v":0},null,null,{"$f":"IF(OR(AD5<>0,AF5<>0),IF(AD5>AF5,2,IF(AD5=AF5,1,0)),0)","v":0},null,null,{"$f":"IF(OR(AG5<>0,AI5<>0),IF(AG5>AI5,2,IF(AG5=AI5,1,0)),0)","v":0},null,null,{"$f":"IF(OR(AJ5<>0,AL5<>0),IF(AJ5>AL5,2,IF(AJ5=AL5,1,0)),0)","v":0},null,null,{"$f":"IF(OR(AM5<>0,AO5<>0),IF(AM5>AO5,2,IF(AM5=AO5,1,0)),0)","v":0},null,{"$f":"AW5+AZ5+BC5+BF5+BI5+BL5+BO5+BR5+BU5+BX5+CA5+CD5+CG5","v":0},{"$nulls":3},{"$f":"RANK(AP5,$AP$5:$AP$17,0)","v":1},{"$f":"B5","v":"t1"}]
[2,{"$f":"IF(Aufstellung!F5<>\"\",Aufstellung!F5,\"\")","v":"t2"},{"$f":"H5","v":0},":",{"$f":"F5","v":0},null,":",null,{"$f":"'Ergebnisse 9er'!E14","v":0},":",{"$f":"'Ergebnisse 9er'!G14","v":0},{"$f":"'Ergebnisse 9er'!G27","v":0},":",{"$f":"'Ergebnisse 9er'!E27","v":0},{"$f":"'Ergebnisse 9er'!E35","v":0},":",{"$f":"'Ergebnisse 9er'!G35","v":0},{"$f":"'Ergebnisse 9er'!G21","v":0},":",{"$f":"'Ergebnisse 9er'!E21","v":0},{"$f":"'Ergebnisse 9er'!E4","v":0},":",{"$f":"'Ergebnisse 9er'!G4","v":0},{"$f":"'Ergebnisse 9er'!N20","v":0},":",{"$f":"'Ergebnisse 9er'!L20","v":0},{"$f":"'Ergebnisse 9er'!L5","v":0},":",{"$f":"'Ergebnisse 9er'!N5","v":0},{"$nulls":12},{"$f":"CI6","v":0},{"$f":"IF((C6+F6+I6+L6+O6+R6+U6+X6+AA6)=0,0,(C6+F6+I6+L6+O6+R6+U6+X6+AA6))","v":0},":",0,{"$f":"IF(AS6=0,0,AQ6/AS6)","v":0},{"$f":"IF(AND(AQ6=0,AS6=0),\"\",CM6)","v":""},null,{"$f":"IF(OR(C6<>0,E6<>0),IF(C6>E6,2,IF(C6=E6,1,0)),0)","v":0},null,null,{"$f":"IF(OR(F6<>0,H6<>0),IF(F6>H6,2,IF(F6=H6,1,0)),0)","v":0},null,null,{"$f":"IF(OR(I6<>0,K6<>0),IF(I6>K6,2,IF(I6=K6,1,0)),0)","v":0},null,null,{"$f":"IF(OR(L6<>0,N6<>0),IF(L6>N6,2,IF(L6=N6,1,0)),0)","v":0},null,null,{"$f":"IF(OR(O6<>0,Q6<>0),IF(O6>Q6,2,IF(O6=Q6,1,0)),0)","v":0},null,null,{"$f":"IF(OR(R6<>0,T6<>0),IF(R6>T6,2,IF(R6=T6,1,0)),0)","v":0},null,null,{"$f":"IF(OR(U6<>0,W6<>0),IF(U6>W6,2,IF(U6=W6,1,0)),0)","v":0},null,null,{"$f":"IF(OR(X6<>0,Z6<>0),IF(X6>Z6,2,IF(X6=Z6,1,0)),0)","v":0},null,null,{"$f":"IF(OR(AA6<>0,AC6<>0),IF(AA6>AC6,2,IF(AA6=AC6,1,0)),0)","v":0},null,null,{"$f":"IF(OR(AD6<>0,AF6<>0),IF(AD6>AF6,2,IF(AD6=AF6,1,0)),0)","v":0},null,null,{"$f":"IF(OR(AG6<>0,AI6<>0),IF(AG6>AI6,2,IF(AG6=AI6,1,0)),0)","v":0},null,null,{"$f":"IF(OR(AJ6<>0,AL6<>0),IF(AJ6>AL6,2,IF(AJ6=AL6,1,0)),0)","v":0},null,null,{"$f":"IF(OR(AM6<>0,AO6<>0),IF(AM6>AO6,2,IF(AM6=AO6,1,0)),0)","v":0},null,{"$f":"AW6+AZ6+BC6+BF6+BI6+BL6+BO6+BR6+BU6+BX6+CA6+CD6+CG6","v":0},{"$nulls":3},1,"t2"]
[3,{"$f":"IF(Aufstellung!H5<>\"\",Aufstellung!H5,\"\")","v":"t3"},{"$f":"K5","v":0},":",{"$f":"I5","v":0},{"$f":"K6","v":0},":",{"$f":"I6","v":0},null,":",null,{"$f":"'Ergebnisse 9er'!L6","v":0},":",{"$f":"'Ergebnisse 9er'!N6","v":0},{"$f":"'Ergebnisse 9er'!N13","v":0},":",{"$f":"'Ergebnisse 9er'!L13","v":0},{"$f":"'Ergebnisse 9er'!E36","v":0},":",{"$f":"'Ergebnisse 9er'!G36","v":0},{"$f":"'Ergebnisse 9er'!G20","v":0},":",{"$f":"'Ergebnisse 9er'!E20","v":0},{"$f":"'Ergebnisse 9er'!E5","v":0},":",{"$f":"'Ergebnisse 9er'!G5","v":0},{"$f":"'Ergebnisse 9er'!N19","v":0},":",{"$f":"'Ergebnisse 9er'!L19","v":0},{"$nulls":12},0,0,":",0,0,"",null,0,null,null,0,null,null,0,null,null,0,null,null,0,null,null,0,null,null,0,null,null,0,null,null,0,null,null,0,null,null,0,null,null,0,null,null,0,null,0,{"$nulls":3},1,"t3"]
[4,{"$f":"IF(Aufstellung!J5<>\"\",Aufstellung!J5,\"\")","v":"t4"},{"$f":"N5","v":0},":",{"$f":"L5","v":0},{"$f":"N6","v":0},":",{"$f":"L6","v":0},{"$f":"N7","v":0},":",{"$f":"L7","v":0},null,":",null,{"$f":"'Ergebnisse 9er'!L28","v":0},":",{"$f":"'Ergebnisse 9er'!N28","v":0},{"$f":"'Ergebnisse 9er'!N12","v":0},":",{"$f":"'Ergebnisse 9er'!L12","v":0},{"$f":"'Ergebnisse 9er'!E37","v":0},":",{"$f":"'Ergebnisse 9er'!G37","v":0},{"$f":"'Ergebnisse 9er'!G19","v":0},":",{"$f":"'Ergebnisse 9er'!E19","v":0},{"$f":"'Ergebnisse 9er'!E6","v":0},":",{"$f":"'Ergebnisse 9er'!G6","v":0},{"$nulls":12},0,0,":",0,0,"",null,0,null,null,0,null,null,0,null,null,0,null,null,0,null,null,0,null,null,0,null,null,0,null,null,0,null,null,0,null,null,0,null,null,0,null,null,0,null,0,{"$nulls":3},1,"t4"]
[5,{"$f":"IF(Aufstellung!B10<>\"\",Aufstellung!B10,\"\")","v":"t5"},{"$f":"Q5","v":0},":",{"$f":"O5","v":0},{"$f":"Q6","v":0},":",{"$f":"O6","v":0},{"$f":"Q7","v":0},":",{"$f":"O7","v":0},{"$f":"Q8","v":0},":",{"$f":"O8","v":0},null,":",null,{"$f":"'Ergebnisse 9er'!N22","v":0},":",{"$f":"'Ergebnisse 9er'!L22","v":0},{"$f":"'Ergebnisse 9er'!L3","v":0},":",{"$f":"'Ergebnisse 9er'!N3","v":0},{"$f":"'Ergebnisse 9er'!G29","v":0},":",{"$f":"'Ergebnisse 9er'!E29","v":0},{"$f":"'Ergebnisse 9er'!E12","v":0},":",{"$f":"'Ergebnisse 9er'!G12","v":0},{"$nulls":12},0,0,":",0,0,"",null,0,null,null,0,null,null,0,null,null,0,null,null,0,null,null,0,null,null,0,null,null,0,null,null,0,null,null,0,null,null,0,null,null,0,null,null,0,null,0,{"$nulls":3},1,"t5"]
[6,{"$f":"IF(Aufstellung!D11<>\"\",Aufstellung!D11,\"\")","v":"t6"},{"$f":"T5","v":0},":",{"$f":"R5","v":0},{"$f":"T6","v":0},":",{"$f":"R6","v":0},{"$f":"T7","v":0},":",{"$f":"R7","v":0},{"$f":"T8","v":0},":",{"$f":"R8","v":0},{"$f":"T9","v":0},":",{"$f":"R9","v":0},null,":",null,{"$f":"'Ergebnisse 9er'!G30","v":0},":",{"$f":"'Ergebnisse 9er'!E30","v":0},{"$f":"'Ergebnisse 9er'!E11","v":0},":",{"$f":"'Ergebnisse 9er'!G11","v":0},{"$f":"'Ergebnisse 9er'!N29","v":0},":",{"$f":"'Ergebnisse 9er'!L29","v":0},{"$nulls":12},0,0,":",0,0,"",null,0,null,null,0,null,null,0,null,null,0,null,null,0,null,null,0,null,null,0,null,null,0,null,null,0,null,null,0,null,null,0,null,null,0,null,null,0,null,0,{"$nulls":3},1,"t6"]
[7,{"$f":"IF(Aufstellung!F11<>\"\",Aufstellung!F11,\"\")","v":"t7"},{"$f":"W5","v":0},":",{"$f":"U5","v":0},{"$f":"W6","v":0},":",{"$f":"U6","v":0},{"$f":"W7","v":0},":",{"$f":"U7","v":0},{"$f":"W8","v":0},":",{"$f":"U8","v":0},{"$f":"W9","v":0},":",{"$f":"U9","v":0},{"$f":"W10","v":0},":",{"$f":"U10","v":0},null,":",null,{"$f":"'Ergebnisse 9er'!N30","v":0},":",{"$f":"'Ergebnisse 9er'!L30","v":0},{"$f":"'Ergebnisse 9er'!L11","v":0},":",{"$f":"'Ergebnisse 9er'!N11","v":0},{"$nulls":12},0,0,":",0,0,"",null,0,null,null,0,null,null,0,null,null,0,null,null,0,null,null,0,null,null,0,null,null,0,null,null,0,null,null,0,null,null,0,null,null,0,null,null,0,null,0,{"$nulls":3},1,"t7"]
[8,{"$f":"IF(Aufstellung!H11<>\"\",Aufstellung!H11,\"\")","v":"t8"},{"$f":"Z5","v":0},":",{"$f":"X5","v":0},{"$f":"Z6","v":0},":",{"$f":"X6","v":0},{"$f":"Z7","v":0},":",{"$f":"X7","v":0},{"$f":"Z8","v":0},":",{"$f":"X8","v":0},{"$f":"Z9","v":0},":",{"$f":"X9","v":0},{"$f":"Z10","v":0},":",{"$f":"X10","v":0},{"$f":"Z11","v":0},":",{"$f":"X11","v":0},null,":",null,{"$f":"'Ergebnisse 9er'!G38","v":0},":",{"$f":"'Ergebnisse 9er'!E38","v":0},{"$nulls":12},0,0,":",0,0,"",null,0,null,null,0,null,null,0,null,null,0,null,null,0,null,null,0,null,null,0,null,null,0,null,null,0,null,null,0,null,null,0,null,null,0,null,null,0,null,0,{"$nulls":3},1,"t8"]
[9,{"$f":"IF(Aufstellung!J11<>\"\",Aufstellung!J11,\"\")","v":"t9"},{"$f":"AC5","v":0},":",{"$f":"AA5","v":0},{"$f":"AC6","v":0},":",{"$f":"AA6","v":0},{"$f":"AC7","v":0},":",{"$f":"AA7","v":0},{"$f":"AC8","v":0},":",{"$f":"AA8","v":0},{"$f":"AC9","v":0},":",{"$f":"AA9","v":0},{"$f":"AC10","v":0},":",{"$f":"AA10","v":0},{"$f":"AC11","v":0},":",{"$f":"AA11","v":0},{"$f":"AC12","v":0},":",{"$f":"AA12","v":0},null,":",{"$nulls":13},0,0,":",0,0,"",null,0,null,null,0,null,null,0,null,null,0,null,null,0,null,null,0,null,null,0,null,null,0,null,null,0,null,null,0,null,null,0,null,null,0,null,null,0,null,0,{"$nulls":3},1,"t9"]
[10,{"$nulls":40},0,{"$f":"IF((C14+F14+I14+L14+O14+R14+U14+X14+AA14+AD14+AG14+AJ14+AM14)=0,0,(C14+F14+I14+L14+O14+R14+U14+X14+AA14+AD14+AG14+AJ14+AM14))","v":0},":",{"$f":"IF((E14+H14+K14+N14+Q14+T14+W14+Z14+AC14+AF14+AI14+AL14+AO14)=0,0,(E14+H14+K14+N14+Q14+T14+W14+Z14+AC14+AF14+AI14+AL14+AO14))","v":0},{"$f":"IF(AQ14=\"\",\"\",AQ14-AS14)","v":0},"",null,0,null,null,0,null,null,0,null,null,0,null,null,0,null,null,0,null,null,0,null,null,0,null,null,0,null,null,0,null,null,0,null,null,0,null,null,0,null,0,{"$nulls":3},1,0]
[11,{"$nulls":40},0,{"$f":"IF((C15+F15+I15+L15+O15+R15+U15+X15+AA15+AD15+AG15+AJ15+AM15)=0,0,(C15+F15+I15+L15+O15+R15+U15+X15+AA15+AD15+AG15+AJ15+AM15))","v":0},":",{"$f":"IF((E15+H15+K15+N15+Q15+T15+W15+Z15+AC15+AF15+AI15+AL15+AO15)=0,0,(E15+H15+K15+N15+Q15+T15+W15+Z15+AC15+AF15+AI15+AL15+AO15))","v":0},0,"",null,0,null,null,0,null,null,0,null,null,0,null,null,0,null,null,0,null,null,0,null,null,0,null,null,0,null,null,0,null,null,0,null,null,0,null,null,0,null,0,{"$nulls":3},1,0]
[12,{"$nulls":40},0,{"$f":"IF((C16+F16+I16+L16+O16+R16+U16+X16+AA16+AD16+AG16+AJ16+AM16)=0,0,(C16+F16+I16+L16+O16+R16+U16+X16+AA16+AD16+AG16+AJ16+AM16))","v":0},":",{"$f":"IF((E16+H16+K16+N16+Q16+T16+W16+Z16+AC16+AF16+AI16+AL16+AO16)=0,0,(E16+H16+K16+N16+Q16+T16+W16+Z16+AC16+AF16+AI16+AL16+AO16))","v":0},0,"",null,0,null,null,0,null,null,0,null,null,0,null,null,0,null,null,0,null,null,0,null,null,0,null,null,0,null,null,0,null,null,0,null,null,0,null,null,0,null,0,{"$nulls":3},1,0]
[13,{"$nulls":40},0,{"$f":"IF((C17+F17+I17+L17+O17+R17+U17+X17+AA17+AD17+AG17+AJ17+AM17)=0,0,(C17+F17+I17+L17+O17+R17+U17+X17+AA17+AD17+AG17+AJ17+AM17))","v":0},":",{"$f":"IF((E17+H17+K17+N17+Q17+T17+W17+Z17+AC17+AF17+AI17+AL17+AO17)=0,0,(E17+H17+K17+N17+Q17+T17+W17+Z17+AC17+AF17+AI17+AL17+AO17))","v":0},0,"",null,0,null,null,0,null,null,0,null,null,0,null,null,0,null,null,0,null,null,0,null,null,0,null,null,0,null,null,0,null,null,0,null,null,0,null,null,0,null,0,{"$nulls":3},1,0]
[]
[null,"Ergebnisübersicht"]
[]
[]
[]
[null,"Platz 1",{"$nulls":10},"Platz 5",{"$nulls":13},"Platz 9",{"$nulls":10},"Platz 13"]
[]
[null,"Platz 2",{"$nulls":10},"Platz 6",{"$nulls":13},"Platz 10"]
[]
[null,"Platz 3",{"$nulls":10},"Platz 7",{"$nulls":13},"Platz 11"]
[]
[null,"Platz 4",{"$nulls":10},"Platz 8",{"$nulls":13},"Platz 12"]

{"sheet":"Aufstellung","index":1,"n_rows":18,"n_cols":10,"rows_kept":18}
[{"$nulls":3},"Fenster",null,"Fenster",null,"Fenster",null,"Fenster"]
[]
[]
[{"$nulls":3},"Team 1:",null,"Team 2:",null,"Team 3:",null,"Team 4:"]
[{"$nulls":3},"t1",null,"t2",null,"t3",null,"t4"]
[]
[null,"Wartetor"]
[]
[null,"Team 5:"]
[null,"t5",null,"Team 6:",null,"Team 7:",null,"Team 8:",null,"Team 9:"]
[{"$nulls":3},"t6",null,"t7",null,"t8",null,"t9"]
[]
[]
[]
[]
[{"$nulls":7},"TÜR"]
[]
[{"$nulls":3},"ROTATION IM UHRZEIGERSINN!!!"]

{"sheet":"Ergebnisse 9er","index":2,"n_rows":39,"n_cols":13,"rows_kept":39,"merged":[[1,1,1,6],[1,8,1,13],[9,1,9,6],[9,8,9,13],[17,1,17,6],[17,8,17,13],[25,1,25,6],[25,8,25,13],[33,1,33,6]]}
[]
[null,"Runde 1",{"$nulls":6},"Runde 2"]
[null,{"$f":"IF(Aufstellung!$D$5=\"\",\"Team 1\",Aufstellung!$D$5)","v":"t1"},":",{"$f":"IF(Aufstellung!$D$11=\"\",\"Team 8\",Aufstellung!$D$11)","v":"t6"},null,":",null,null,{"$f":"D7","v":"t5"},":",{"$f":"D4","v":"t7"},null,":"]
[null,{"$f":"IF(Aufstellung!$F$5=\"\",\"Team 2\",Aufstellung!$F$5)","v":"t2"},":",{"$f":"IF(Aufstellung!$F$11=\"\",\"Team 9\",Aufstellung!$F$11)","v":"t7"},null,":",null,null,{"$f":"B3","v":"t1"},":",{"$f":"D5","v":"t8"},null,":"]
[null,{"$f":"IF(Aufstellung!$H$5=\"\",\"Team 3\",Aufstellung!$H$5)","v":"t3"},":",{"$f":"IF(Aufstellung!$H$11=\"\",\"Team 10\",Aufstellung!$H$11)","v":"t8"},null,":",null,null,{"$f":"B4","v":"t2"},":",{"$f":"D6","v":"t9"},null,":"]
[null,{"$f":"IF(Aufstellung!$J$5=\"\",\"Team 4\",Aufstellung!$J$5)","v":"t4"},":",{"$f":"IF(Aufstellung!$J$11=\"\",\"Team 11\",Aufstellung!$J$11)","v":"t9"},null,":",null,null,{"$f":"B5","v":"t3"},":",{"$f":"B6","v":"t4"},null,":"]
[null,"frei:",null,{"$f":"IF(Aufstellung!$B$10=\"\",\"Team 7\",Aufstellung!$B$10)","v":"t5"},{"$nulls":4},"frei:",null,{"$f":"D3","v":"t6"}]
[]
[]
[null,"Runde 3",{"$nulls":6},"Runde 4"]
[null,{"$f":"K7","v":"t6"},":",{"$f":"K4","v":"t8"},null,":",null,null,{"$f":"D15","v":"t7"},":",{"$f":"D12","v":"t9"},null,":"]
[null,{"$f":"I3","v":"t5"},":",{"$f":"K5","v":"t9"},null,":",null,null,{"$f":"B11","v":"t6"},":",{"$f":"D13","v":"t4"},null,":"]
[null,{"$f":"I4","v":"t1"},":",{"$f":"K6","v":"t4"},null,":",null,null,{"$f":"B12","v":"t5"},":",{"$f":"D14","v":"t3"},null,":"]
[null,{"$f":"I5","v":"t2"},":",{"$f":"B5","v":"t3"},null,":",null,null,{"$f":"B13","v":"t1"},":",{"$f":"B4","v":"t2"},null,":"]
[null,"frei:",null,{"$f":"K3","v":"t7"},{"$nulls":4},"frei:",null,{"$f":"D11","v":"t8"}]
[]
[]
[null,"Runde 5",{"$nulls":6},"Runde 6"]
[null,{"$f":"K15","v":"t8"},":",{"$f":"K12","v":"t4"},null,":",null,null,{"$f":"D23","v":"t9"},":",{"$f":"D20","v":"t3"},null,":"]
[null,{"$f":"I11","v":"t7"},":",{"$f":"K13","v":"t3"},null,":",null,null,{"$f":"B19","v":"t8"},":",{"$f":"D21","v":"t2"},null,":"]
[null,{"$f":"I12","v":"t6"},":",{"$f":"K14","v":"t2"},null,":",null,null,{"$f":"B20","v":"t7"},":",{"$f":"D22","v":"t1"},null,":"]
[null,{"$f":"I13","v":"t5"},":",{"$f":"B3","v":"t1"},null,":",null,null,{"$f":"B21","v":"t6"},":",{"$f":"D7","v":"t5"},null,":"]
[null,"frei:",null,{"$f":"K11","v":"t9"},{"$nulls":4},"frei:",null,{"$f":"D19","v":"t4"}]
[]
[]
[null,"Runde 7",{"$nulls":6},"Runde 8"]
[null,{"$f":"K23","v":"t4"},":",{"$f":"K20","v":"t2"},null,":",null,null,{"$f":"D31","v":"t3"},":",{"$f":"D28","v":"t1"},null,":"]
[null,{"$f":"I19","v":"t9"},":",{"$f":"K21","v":"t1"},null,":",null,null,{"$f":"B27","v":"t4"},":",{"$f":"D29","v":"t5"},null,":"]
[null,{"$f":"I20","v":"t8"},":",{"$f":"K22","v":"t5"},null,":",null,null,{"$f":"B28","v":"t9"},":",{"$f":"D30","v":"t6"},null,":"]
[null,{"$f":"I21","v":"t7"},":",{"$f":"D3","v":"t6"},null,":",null,null,{"$f":"B29","v":"t8"},":",{"$f":"D4","v":"t7"},null,":"]
[null,"frei:",null,{"$f":"K19","v":"t3"},{"$nulls":4},"frei:",null,{"$f":"D27","v":"t2"}]
[]
[]
[null,"Runde 9"]
[null,{"$f":"K31","v":"t2"},":",{"$f":"K28","v":"t5"},null,":"]
[null,{"$f":"I27","v":"t3"},":",{"$f":"K29","v":"t6"},null,":"]
[null,{"$f":"I28","v":"t4"},":",{"$f":"K30","v":"t7"},null,":"]
[null,{"$f":"I29","v":"t9"},":",{"$f":"D5","v":"t8"},null,":"]
[null,"frei:",null,{"$f":"K27","v":"t1"}]